Target
DNA ligase
Ligand
BDBM50444575
Substrate
Meas. Tech.
ChEMBL_1281919 (CHEMBL3101193)
IC50
53000±n/a nM
Citation
 Howard, SAmin, NBenowitz, ABChiarparin, ECui, HDeng, XHeightman, TDHolmes, DJHopkins, AHuang, JJin, QKreatsoulas, CMartin, ACMassey, FMcCloskey, LMortenson, PNPathuri, PTisi, DWilliams, PA Fragment-based discovery of 6-azaindazoles as inhibitors of bacterial DNA ligase. ACS Med Chem Lett 4:1208-12 (2013)  
Target
Name:
DNA ligase
Synonyms:
DNLJ_STAAU lig | ligA
Type:
PROTEIN
Mol. Mass.:
75059.93
Organism:
Staphylococcus aureus
Description:
ChEMBL_1281598
Residue:
667
  
Inhibitor
Name:
BDBM50444575
Synonyms:
CHEMBL3099710
Type:
Small organic molecule
Emp. Form.:
C11H12N4
Mol. Mass.:
200.2398
SMILES:
C1CC(C1)c1cccc(n1)-c1nnc[nH]1
: