Target
DNA ligase
Ligand
BDBM50444576
Substrate
Meas. Tech.
ChEMBL_1281918 (CHEMBL3101192)
Kd
38000±n/a nM
Citation
 Howard, SAmin, NBenowitz, ABChiarparin, ECui, HDeng, XHeightman, TDHolmes, DJHopkins, AHuang, JJin, QKreatsoulas, CMartin, ACMassey, FMcCloskey, LMortenson, PNPathuri, PTisi, DWilliams, PA Fragment-based discovery of 6-azaindazoles as inhibitors of bacterial DNA ligase. ACS Med Chem Lett 4:1208-12 (2013)  
Target
Name:
DNA ligase
Synonyms:
DNLJ_STAAU lig | ligA
Type:
PROTEIN
Mol. Mass.:
75059.93
Organism:
Staphylococcus aureus
Description:
ChEMBL_1281598
Residue:
667
  
Inhibitor
Name:
BDBM50444576
Synonyms:
CHEMBL3099705
Type:
Small organic molecule
Emp. Form.:
C6H4ClN5
Mol. Mass.:
181.582
SMILES:
Clc1cncc(n1)-c1nnc[nH]1
: