Target
DNA ligase
Ligand
BDBM50444580
Substrate
Meas. Tech.
ChEMBL_1281919 (CHEMBL3101193)
IC50
230±n/a nM
Citation
 Howard, SAmin, NBenowitz, ABChiarparin, ECui, HDeng, XHeightman, TDHolmes, DJHopkins, AHuang, JJin, QKreatsoulas, CMartin, ACMassey, FMcCloskey, LMortenson, PNPathuri, PTisi, DWilliams, PA Fragment-based discovery of 6-azaindazoles as inhibitors of bacterial DNA ligase. ACS Med Chem Lett 4:1208-12 (2013)  
Target
Name:
DNA ligase
Synonyms:
DNLJ_STAAU lig | ligA
Type:
PROTEIN
Mol. Mass.:
75059.93
Organism:
Staphylococcus aureus
Description:
ChEMBL_1281598
Residue:
667
  
Inhibitor
Name:
BDBM50444580
Synonyms:
CHEMBL3099714
Type:
Small organic molecule
Emp. Form.:
C14H12F3N5O
Mol. Mass.:
323.2732
SMILES:
OCCNc1cc(nc(c1)C(F)(F)F)-c1n[nH]c2cnccc12
: