Target
NAD-dependent protein deacetylase sirtuin-1
Ligand
BDBM50405320
Substrate
Meas. Tech.
ChEMBL_1283305 (CHEMBL3101446)
IC50
1000000±n/a nM
Citation
 Chen, YPCatbagan, CCBowler, JTGokey, TGoodwin, NDGuliaev, ABWu, WAmagata, T Evaluation of benzoic acid derivatives as sirtuin inhibitors. Bioorg Med Chem Lett 24:349-52 (2013)  
Target
Name:
NAD-dependent protein deacetylase sirtuin-1
Synonyms:
NAD-Dependent Deacetylase Sirtuin-1 NAD-dependent protein deacetylase sirtuin-1 (SIRT1) SIR2-like protein 1 SIRT1 Sirtuin-1 (SIRT1) | hSIR2
Type:
Developmental protein; hydrolase
Mol. Mass.:
81626.66
Organism:
Homo sapiens (Human)
Description:
Residue:
747
  
Inhibitor
Name:
BDBM50405320
Synonyms:
CHEMBL93746
Type:
Small organic molecule
Emp. Form.:
C11H14O2
Mol. Mass.:
178.2277
SMILES:
CC(C)(C)c1ccc(cc1)C(O)=O
: