Target
Neuronal acetylcholine receptor subunit alpha-3/alpha-6/beta-3
Ligand
BDBM50445324
Substrate
Meas. Tech.
ChEMBL_1285325 (CHEMBL3107575)
IC50
140±n/a nM
Citation
 Luo, SZhangsun, DZhu, XWu, YHu, YChristensen, SHarvey, PJAkcan, MCraik, DJMcIntosh, JM Characterization of a novela-conotoxin TxID from Conus textile that potently blocks rata3ß4 nicotinic acetylcholine receptors. J Med Chem 56:9655-63 (2014)  
Target
Name:
Neuronal acetylcholine receptor subunit alpha-3/alpha-6/beta-3
Synonyms:
Nicotinic acetylcholine receptor alpha6/alpha3/beta2/beta3
Type:
Mol. Mass.:
Description:
ASSAY_ID of ChEMBL is 1285295
Components:
This complex has 4 components.
Component 1
Name:
Neuronal acetylcholine receptor subunit alpha-6
Synonyms:
ACHA6_RAT Chrna6 Neuronal acetylcholine receptor subunit alpha-6 | Neuronal acetylcholine receptor subunit alpha-6/beta-3
Type:
PROTEIN
Mol. Mass.:
56943.53
Organism:
Rattus norvegicus
Description:
ChEMBL_1454451
Residue:
493
  
Component 2
Name:
Neuronal acetylcholine receptor subunit alpha-3
Synonyms:
ACHA3_RAT Chrna3
Type:
Enzyme
Mol. Mass.:
56995.52
Organism:
Rattus norvegicus (Rat)
Description:
P04757
Residue:
499
  
Component 3
Name:
Neuronal acetylcholine receptor subunit beta-3
Synonyms:
ACHB3_RAT Chrnb3 | Neuronal acetylcholine receptor protein beta-3 subunit
Type:
PROTEIN
Mol. Mass.:
53270.05
Organism:
Rattus norvegicus
Description:
EBI_10644
Residue:
464
  
Component 4
Name:
Neuronal acetylcholine receptor subunit beta-3
Synonyms:
ACHB3_RAT Chrnb3 | Neuronal acetylcholine receptor protein beta-3 subunit
Type:
PROTEIN
Mol. Mass.:
53270.05
Organism:
Rattus norvegicus
Description:
EBI_10644
Residue:
464
  
Inhibitor
Name:
BDBM50445324
Synonyms:
CHEMBL3104237
Type:
Small organic molecule
Emp. Form.:
C71H103N23O25S4
Mol. Mass.:
1806.977
SMILES:
CC[C@H](C)[C@@H]1NC(=O)[C@H](CCC(O)=O)NC(=O)[C@@H]2CCCN2C(=O)[C@H](Cc2cnc[nH]2)NC(=O)[C@H](CC(O)=O)NC(=O)[C@H](Cc2ccc(O)cc2)NC(=O)[C@H](CC(N)=O)NC(=O)[C@@H]2CSSC[C@H](NC(=O)CN)C(=O)N[C@@H](CSSC[C@H](NC1=O)C(N)=O)C(=O)N[C@@H](CO)C(=O)N[C@@H](CC(O)=O)C(=O)N1CCC[C@H]1C(=O)N[C@@H](CCCN=C(N)N)C(=O)N2
: