Target
15-hydroxyprostaglandin dehydrogenase [NAD(+)]
Ligand
BDBM50445534
Substrate
Meas. Tech.
ChEMBL_1285219 (CHEMBL3107150)
IC50
68±n/a nM
Citation
 Duveau, DYYasgar, AWang, YHu, XKouznetsova, JBrimacombe, KRJadhav, ASimeonov, AThomas, CJMaloney, DJ Structure-activity relationship studies and biological characterization of human NAD(+)-dependent 15-hydroxyprostaglandin dehydrogenase inhibitors. Bioorg Med Chem Lett 24:630-5 (2014)  
Target
Name:
15-hydroxyprostaglandin dehydrogenase [NAD(+)]
Synonyms:
15-PGDH HPGD PGDH_HUMAN SDR36C1
Type:
Enzyme
Mol. Mass.:
28974.46
Organism:
Homo sapiens (Human)
Description:
P15428
Residue:
266
  
Inhibitor
Name:
BDBM50445534
Synonyms:
CHEMBL3103021
Type:
Small organic molecule
Emp. Form.:
C22H25N3O
Mol. Mass.:
347.4534
SMILES:
Cc1cccc(c1)-n1cnc2cc(ccc12)C(=O)N1CCCC(C)(C)C1
: