Target
Nuclear receptor ROR-gamma
Ligand
BDBM50445876
Substrate
Meas. Tech.
ChEMBL_1285940 (CHEMBL3106083)
Ki
25±n/a nM
Citation
 Wang, YCai, WZhang, GYang, TLiu, QCheng, YZhou, LMa, YCheng, ZLu, SZhao, YGZhang, WXiang, ZWang, SYang, LWu, QOrband-Miller, LAXu, YZhang, JGao, RHuxdorf, MXiang, JNZhong, ZElliott, JDLeung, SLin, X Discovery of novel N-(5-(arylcarbonyl)thiazol-2-yl)amides and N-(5-(arylcarbonyl)thiophen-2-yl)amides as potent ROR¿t inhibitors. Bioorg Med Chem 22:692-702 (2014)  
Target
Name:
Nuclear receptor ROR-gamma
Synonyms:
NR1F3 Nuclear receptor ROR-gamma (RORC) RAR-related orphan receptor C (RORc) RORG RZRG Retinoid-related orphan receptor-gamma (RORc)
Type:
Enzyme Catalytic Domain
Mol. Mass.:
58218.40
Organism:
Homo sapiens (Human)
Description:
P51449
Residue:
518
  
Inhibitor
Name:
BDBM50445876
Synonyms:
CHEMBL3105692
Type:
Small organic molecule
Emp. Form.:
C27H21Cl2NO4S2
Mol. Mass.:
558.496
SMILES:
CCS(=O)(=O)c1ccc(CC(=O)Nc2cc(c(s2)C(=O)c2ccccc2Cl)-c2cccc(Cl)c2)cc1
: