Target
Oligo-1,6-glucosidase IMA1
Ligand
BDBM50445971
Substrate
Meas. Tech.
ChEMBL_1283539 (CHEMBL3107470)
IC50
53420±n/a nM
Citation
 Khan, MSMunawar, MAAshraf, MAlam, UAta, AAsiri, AMKousar, SKhan, MA Synthesis of novel indenoquinoxaline derivatives as potenta-glucosidase inhibitors. Bioorg Med Chem 22:1195-200 (2014)  
Target
Name:
Oligo-1,6-glucosidase IMA1
Synonyms:
α-glucosidase Alpha-glucosidase (α-glucosidase) MALX3_YEAST | Oligo-1,6-glucosidase
Type:
Protein
Mol. Mass.:
68577.59
Organism:
Saccharomyces cerevisiae S288c (Baker's yeast)
Description:
Residue:
589
  
Inhibitor
Name:
BDBM50445971
Synonyms:
CHEMBL3103155
Type:
Small organic molecule
Emp. Form.:
C22H13FN4O
Mol. Mass.:
368.3632
SMILES:
Fc1ccc(cc1)C(=O)N=Nc1c2ccccc2c2nc3ccccc3[nH]c12
: