Target
Calmodulin-domain protein kinase 1
Ligand
BDBM50446180
Substrate
Meas. Tech.
ChEMBL_1287980 (CHEMBL3110679)
IC50
2.0±n/a nM
Citation
 Zhang, ZOjo, KKVidadala, RHuang, WGeiger, JAScheele, SChoi, RReid, MCKeyloun, KRRivas, KSiddaramaiah, LKComess, KMRobinson, KPMerta, PJKifle, LHol, WGParsons, MMerritt, EAMaly, DJVerlinde, CLVan Voorhis, WCFan, E Potent and selective inhibitors of CDPK1 from ACS Med Chem Lett 5:40-44 (2014)  
Target
Name:
Calmodulin-domain protein kinase 1
Synonyms:
Calmodulin-domain protein kinase 1 Calmodulin-domain protein kinase, putative
Type:
Enzyme Catalytic Domain
Mol. Mass.:
57248.42
Organism:
Toxoplasma gondii
Description:
Residue:
507
  
Inhibitor
Name:
BDBM50446180
Synonyms:
CHEMBL3108998 US9956214, Compound 25
Type:
Small organic molecule
Emp. Form.:
C19H22N4O2
Mol. Mass.:
338.4036
SMILES:
COc1ccc2cc(ccc2c1)-c1nn(c(N)c1C(N)=O)C(C)(C)C
: