Target
Substance-K receptor
Ligand
BDBM50446427
Substrate
Meas. Tech.
ChEMBL_1287447 (CHEMBL3111742)
IC50
46000±n/a nM
Citation
 Röver, SAndjelkovic, MBénardeau, AChaput, EGuba, WHebeisen, PMohr, SNettekoven, MObst, URichter, WFUllmer, CWaldmeier, PWright, MB 6-Alkoxy-5-aryl-3-pyridinecarboxamides, a new series of bioavailable cannabinoid receptor type 1 (CB1) antagonists including peripherally selective compounds. J Med Chem 56:9874-96 (2013)  
Target
Name:
Substance-K receptor
Synonyms:
NK-2 receptor NK2R NKNAR Neurokinin A receptor Neurokinin-2 (NK-2) SKR TACR2 Tachykinin receptor 2 (NK2) | hnk-3
Type:
Protein
Mol. Mass.:
44455.78
Organism:
Homo sapiens (Human)
Description:
P21452
Residue:
398
  
Inhibitor
Name:
BDBM50446427
Synonyms:
CHEMBL3109772
Type:
Small organic molecule
Emp. Form.:
C21H25ClN2O4
Mol. Mass.:
404.887
SMILES:
COCCOc1ncc(cc1-c1ccc(Cl)cc1)C(=O)N[C@@H]1CCCC[C@H]1O
: