Target
C-X-C chemokine receptor type 3
Ligand
BDBM50446641
Substrate
Meas. Tech.
ChEMBL_1290437 (CHEMBL3119548)
IC50
1.000000±n/a nM
Citation
 Nair, AGWong, MKShu, YJiang, YJenh, CHKim, SHYang, DYZeng, QShao, YZawacki, LGDuo, JMcGuinness, BFCarroll, CDHobbs, DWShih, NYRosenblum, SBKozlowski, JA IV. Discovery of CXCR3 antagonists substituted with heterocycles as amide surrogates: improved PK, hERG and metabolic profiles. Bioorg Med Chem Lett 24:1085-8 (2014)  
Target
Name:
C-X-C chemokine receptor type 3
Synonyms:
AAO92295.1 C-X-C chemokine receptor type 3 (CXCR3) CXCR3 CXCR3_HUMAN chemokine (C-X-C motif) receptor 3
Type:
Enzyme Catalytic Domain
Mol. Mass.:
40665.65
Organism:
Homo sapiens (Human)
Description:
Residue:
368
  
Inhibitor
Name:
BDBM50446641
Synonyms:
CHEMBL3116486
Type:
Small organic molecule
Emp. Form.:
C25H33Cl2N11O2
Mol. Mass.:
590.508
SMILES:
CCNc1nnc(o1)-c1nc(Cl)c(nc1N)N1CCN([C@@H](CC)C1)C1CCN(CC1)C(=O)c1ccc(Cl)nc1N
: