Target
Cholinesterase
Ligand
BDBM50447015
Substrate
Meas. Tech.
ChEMBL_1289180 (CHEMBL3119242)
IC50
1500±n/a nM
Citation
 González-Naranjo, PPérez-Macias, NCampillo, NEPérez, CArán, VJGirón, RSánchez-Robles, EMartín, MIGómez-Cañas, MGarcía-Arencibia, MFernández-Ruiz, JPáez, JA Cannabinoid agonists showing BuChE inhibition as potential therapeutic agents for Alzheimer's disease. Eur J Med Chem 73:56-72 (2014)  
Target
Name:
Cholinesterase
Synonyms:
BCHE CHLE_HORSE | Cholinesterase
Type:
Enzyme
Mol. Mass.:
65643.35
Organism:
Equus caballus (Horse)
Description:
P81908
Residue:
574
  
Inhibitor
Name:
BDBM50447015
Synonyms:
CHEMBL3116300
Type:
Small organic molecule
Emp. Form.:
C25H28N4O
Mol. Mass.:
400.516
SMILES:
Nc1ccc2n(CCN3CCCCC3)nc(OCc3ccc4ccccc4c3)c2c1
: