Target
Cholinesterase
Ligand
BDBM50447016
Substrate
Meas. Tech.
ChEMBL_1289180 (CHEMBL3119242)
IC50
>10000±n/a nM
Citation
 González-Naranjo, PPérez-Macias, NCampillo, NEPérez, CArán, VJGirón, RSánchez-Robles, EMartín, MIGómez-Cañas, MGarcía-Arencibia, MFernández-Ruiz, JPáez, JA Cannabinoid agonists showing BuChE inhibition as potential therapeutic agents for Alzheimer's disease. Eur J Med Chem 73:56-72 (2014)  
Target
Name:
Cholinesterase
Synonyms:
BCHE CHLE_HORSE | Cholinesterase
Type:
Enzyme
Mol. Mass.:
65643.35
Organism:
Equus caballus (Horse)
Description:
P81908
Residue:
574
  
Inhibitor
Name:
BDBM50447016
Synonyms:
CHEMBL3116298
Type:
Small organic molecule
Emp. Form.:
C21H19N3O
Mol. Mass.:
329.3951
SMILES:
Nc1ccc2n(Cc3ccccc3)nc(OCc3ccccc3)c2c1
: