Target
Cholinesterase
Ligand
BDBM50447024
Substrate
Meas. Tech.
ChEMBL_1289180 (CHEMBL3119242)
IC50
>10000±n/a nM
Citation
 González-Naranjo, PPérez-Macias, NCampillo, NEPérez, CArán, VJGirón, RSánchez-Robles, EMartín, MIGómez-Cañas, MGarcía-Arencibia, MFernández-Ruiz, JPáez, JA Cannabinoid agonists showing BuChE inhibition as potential therapeutic agents for Alzheimer's disease. Eur J Med Chem 73:56-72 (2014)  
Target
Name:
Cholinesterase
Synonyms:
BCHE CHLE_HORSE | Cholinesterase
Type:
Enzyme
Mol. Mass.:
65643.35
Organism:
Equus caballus (Horse)
Description:
P81908
Residue:
574
  
Inhibitor
Name:
BDBM50447024
Synonyms:
CHEMBL3116288
Type:
Small organic molecule
Emp. Form.:
C21H23N3O3
Mol. Mass.:
365.4256
SMILES:
[O-][N+](=O)c1ccc2n(Cc3ccccc3)nc(OCC3CCCCC3)c2c1
: