Target
Cholinesterase
Ligand
BDBM50447025
Substrate
Meas. Tech.
ChEMBL_1289180 (CHEMBL3119242)
IC50
>10000±n/a nM
Citation
 González-Naranjo, PPérez-Macias, NCampillo, NEPérez, CArán, VJGirón, RSánchez-Robles, EMartín, MIGómez-Cañas, MGarcía-Arencibia, MFernández-Ruiz, JPáez, JA Cannabinoid agonists showing BuChE inhibition as potential therapeutic agents for Alzheimer's disease. Eur J Med Chem 73:56-72 (2014)  
Target
Name:
Cholinesterase
Synonyms:
BCHE CHLE_HORSE | Cholinesterase
Type:
Enzyme
Mol. Mass.:
65643.35
Organism:
Equus caballus (Horse)
Description:
P81908
Residue:
574
  
Inhibitor
Name:
BDBM50447025
Synonyms:
CHEMBL3116287
Type:
Small organic molecule
Emp. Form.:
C17H25N3O3
Mol. Mass.:
319.3987
SMILES:
CCCCCOc1nn(CCCCC)c2ccc(cc12)[N+]([O-])=O
: