Target
Cholinesterase
Ligand
BDBM50447028
Substrate
Meas. Tech.
ChEMBL_1289180 (CHEMBL3119242)
IC50
6700±n/a nM
Citation
 González-Naranjo, PPérez-Macias, NCampillo, NEPérez, CArán, VJGirón, RSánchez-Robles, EMartín, MIGómez-Cañas, MGarcía-Arencibia, MFernández-Ruiz, JPáez, JA Cannabinoid agonists showing BuChE inhibition as potential therapeutic agents for Alzheimer's disease. Eur J Med Chem 73:56-72 (2014)  
Target
Name:
Cholinesterase
Synonyms:
BCHE CHLE_HORSE | Cholinesterase
Type:
Enzyme
Mol. Mass.:
65643.35
Organism:
Equus caballus (Horse)
Description:
P81908
Residue:
574
  
Inhibitor
Name:
BDBM50447028
Synonyms:
CHEMBL3116283
Type:
Small organic molecule
Emp. Form.:
C24H25N3O
Mol. Mass.:
371.4748
SMILES:
C(Cn1nc(OCc2cccc3ccccc23)c2ccccc12)N1CCCC1
: