Target
Cholinesterase
Ligand
BDBM50447030
Substrate
Meas. Tech.
ChEMBL_1289180 (CHEMBL3119242)
IC50
2280±n/a nM
Citation
 González-Naranjo, PPérez-Macias, NCampillo, NEPérez, CArán, VJGirón, RSánchez-Robles, EMartín, MIGómez-Cañas, MGarcía-Arencibia, MFernández-Ruiz, JPáez, JA Cannabinoid agonists showing BuChE inhibition as potential therapeutic agents for Alzheimer's disease. Eur J Med Chem 73:56-72 (2014)  
Target
Name:
Cholinesterase
Synonyms:
BCHE CHLE_HORSE | Cholinesterase
Type:
Enzyme
Mol. Mass.:
65643.35
Organism:
Equus caballus (Horse)
Description:
P81908
Residue:
574
  
Inhibitor
Name:
BDBM50447030
Synonyms:
CHEMBL3116280
Type:
Small organic molecule
Emp. Form.:
C23H31N3O2
Mol. Mass.:
381.5111
SMILES:
COc1ccc(COc2nn(CCN(C(C)C)C(C)C)c3ccccc23)cc1
: