Target
Cytochrome P450 2D6
Ligand
BDBM50447391
Substrate
Meas. Tech.
ChEMBL_1291568 (CHEMBL3118924)
IC50
900±n/a nM
Citation
 Liu, HXu, LHui, HVivian, RCallebaut, CMurray, BPHong, ALee, MSTsai, LKChau, JKStray, KMCannizzaro, CChoi, YCRhodes, GRDesai, MC Structure-activity relationships of diamine inhibitors of cytochrome P450 (CYP) 3A as novel pharmacoenhancers, part I: core region. Bioorg Med Chem Lett 24:989-94 (2014)  
Target
Name:
Cytochrome P450 2D6
Synonyms:
CP2D6_HUMAN CYP2DL1 Cytochrome P450 2D6 (CYP2D6) P450-DB1
Type:
Protein
Mol. Mass.:
55774.82
Organism:
Homo sapiens (Human)
Description:
P10635
Residue:
497
  
Inhibitor
Name:
BDBM50447391
Synonyms:
CHEMBL3114730
Type:
Small organic molecule
Emp. Form.:
C36H46N6O4S2
Mol. Mass.:
690.918
SMILES:
CC(C)[C@H](NC(=O)N(C)Cc1csc(n1)C(C)C)C(=O)N[C@H](CCN(Cc1ccccc1)C(=O)OCc1cncs1)Cc1ccccc1
: