Target
Cytochrome P450 1A2
Ligand
BDBM50447389
Substrate
Meas. Tech.
ChEMBL_1291569 (CHEMBL3118925)
IC50
>25000±n/a nM
Citation
 Liu, HXu, LHui, HVivian, RCallebaut, CMurray, BPHong, ALee, MSTsai, LKChau, JKStray, KMCannizzaro, CChoi, YCRhodes, GRDesai, MC Structure-activity relationships of diamine inhibitors of cytochrome P450 (CYP) 3A as novel pharmacoenhancers, part I: core region. Bioorg Med Chem Lett 24:989-94 (2014)  
Target
Name:
Cytochrome P450 1A2
Synonyms:
CP1A2_HUMAN CYPIA2 Cytochrome P(3)450 Cytochrome P450 1A2 (CYP1A2) Cytochrome P450-P3
Type:
Enzyme
Mol. Mass.:
58423.38
Organism:
Homo sapiens (Human)
Description:
P05177
Residue:
516
  
Inhibitor
Name:
BDBM50447389
Synonyms:
CHEMBL3114735
Type:
Small organic molecule
Emp. Form.:
C36H53N7O5S2
Mol. Mass.:
727.98
SMILES:
CC(C)CN(CC[C@H](Cc1ccccc1)NC(=O)OCc1cncs1)C(=O)[C@H](CCN1CCOCC1)NC(=O)N(C)Cc1csc(n1)C(C)C
: