Target
Orexin receptor type 2
Ligand
BDBM50447762
Substrate
Meas. Tech.
ChEMBL_1290418 (CHEMBL3119327)
IC50
329±n/a nM
Citation
 Sifferlen, TBoller, AChardonneau, ACottreel, EHoecker, JAissaoui, HWilliams, JTBrotschi, CHeidmann, BSiegrist, RGatfield, JTreiber, ABrisbare-Roch, CJenck, FBoss, C Discovery of substituted lactams as novel dual orexin receptor antagonists. Synthesis, preliminary structure-activity relationship studies and efforts towards improved metabolic stability and pharmacokinetic properties. Part 1. Bioorg Med Chem Lett 24:1201-8 (2014)  
Target
Name:
Orexin receptor type 2
Synonyms:
HCRTR2 OX2R_HUMAN Orexin receptor type 2 (OR-2) Orexin receptor type 2 (OX2R) Ox-2-R | Ox2-R
Type:
Protein
Mol. Mass.:
50710.53
Organism:
Homo sapiens (Human)
Description:
O43614
Residue:
444
  
Inhibitor
Name:
BDBM50447762
Synonyms:
CHEMBL3112601 | US9242970, 4
Type:
Small organic molecule
Emp. Form.:
C23H24N2O3
Mol. Mass.:
376.4483
SMILES:
COc1cccc(OC)c1C1CCCC(=O)N1Cc1ccc2ccccc2n1
: