Target
N-arachidonyl glycine receptor
Ligand
BDBM50448073
Substrate
Meas. Tech.
ChEMBL_1292268 (CHEMBL3124699)
IC50
>10000±n/a nM
Citation
 Harms, HRempel, VKehraus, SKaiser, MHufendiek, PMüller, CEKönig, GM Indoloditerpenes from a marine-derived fungal strain of Dichotomomyces cejpii with antagonistic activity at GPR18 and cannabinoid receptors. J Nat Prod 77:673-7 (2014)  
Target
Name:
N-arachidonyl glycine receptor
Synonyms:
G-protein coupled receptor 18 GPR18 NAGly receptor
Type:
PROTEIN
Mol. Mass.:
38150.44
Organism:
Homo sapiens (Human)
Description:
ChEMBL_107601
Residue:
331
  
Inhibitor
Name:
BDBM50448073
Synonyms:
CHEMBL3120631
Type:
Small organic molecule
Emp. Form.:
C34H49NO6
Mol. Mass.:
567.756
SMILES:
CC(C)=CCC[C@]1(C)[C@H](CC[C@@]2(C)[C@H]1CC[C@H]1Cc3c([nH]c4ccccc34)[C@]21C)O[C@@H]1O[C@H](CO)[C@@H](O)[C@H](O)[C@@H]1O
: