Target
CD209 antigen
Ligand
BDBM50448393
Substrate
Meas. Tech.
ChEMBL_1292697 (CHEMBL3123564)
IC50
2410000±n/a nM
Citation
 Tomašic, THajšek, DŠvajger, ULuzar, JObermajer, NPetit-Haertlein, IFieschi, FAnderluh, M Monovalent mannose-based DC-SIGN antagonists: targeting the hydrophobic groove of the receptor. Eur J Med Chem 75:308-26 (2014)  
Target
Name:
CD209 antigen
Synonyms:
C-type lectin domain family 4 member L CD209_HUMAN CLEC4L DC-SIGN1 | Dendritic cell-specific ICAM-3-grabbing non-integrin 1
Type:
PROTEIN
Mol. Mass.:
45768.84
Organism:
Homo sapiens (Human)
Description:
ChEMBL_104194
Residue:
404
  
Inhibitor
Name:
BDBM50448393
Synonyms:
CHEMBL3121708
Type:
Small organic molecule
Emp. Form.:
C21H26O8
Mol. Mass.:
406.4263
SMILES:
OC[C@H]1O[C@H](OC(COc2ccccc2)COc2ccccc2)[C@@H](O)[C@@H](O)[C@@H]1O
: