Target
CD209 antigen
Ligand
BDBM50448402
Substrate
Meas. Tech.
ChEMBL_1292697 (CHEMBL3123564)
IC50
2760000±n/a nM
Citation
 Tomašic, THajšek, DŠvajger, ULuzar, JObermajer, NPetit-Haertlein, IFieschi, FAnderluh, M Monovalent mannose-based DC-SIGN antagonists: targeting the hydrophobic groove of the receptor. Eur J Med Chem 75:308-26 (2014)  
Target
Name:
CD209 antigen
Synonyms:
C-type lectin domain family 4 member L CD209_HUMAN CLEC4L DC-SIGN1 | Dendritic cell-specific ICAM-3-grabbing non-integrin 1
Type:
PROTEIN
Mol. Mass.:
45768.84
Organism:
Homo sapiens (Human)
Description:
ChEMBL_104194
Residue:
404
  
Inhibitor
Name:
BDBM50448402
Synonyms:
CHEMBL3121699
Type:
Small organic molecule
Emp. Form.:
C18H29N3O11
Mol. Mass.:
463.4364
SMILES:
COC(=O)[C@H]1C[C@H](OCCN=[N+]=[N-])[C@H](C[C@@H]1C(=O)OC)O[C@H]1O[C@H](CO)[C@@H](O)[C@H](O)[C@@H]1O
: