Target
Nuclear receptor ROR-alpha
Ligand
BDBM50448404
Substrate
Meas. Tech.
ChEMBL_1292855 (CHEMBL3122594)
IC50
>10000±n/a nM
Citation
 Toyama, HNakamura, MNakamura, MMatsumoto, YNakagomi, MHashimoto, Y Development of novel silicon-containing inverse agonists of retinoic acid receptor-related orphan receptors. Bioorg Med Chem 22:1948-59 (2014)  
Target
Name:
Nuclear receptor ROR-alpha
Synonyms:
NR1F1 Nuclear receptor subfamily 1 group F member 1 RORA RZRA | Retinoid-related orphan receptor-alpha
Type:
PROTEIN
Mol. Mass.:
58976.26
Organism:
Homo sapiens (Human)
Description:
ChEMBL_101591
Residue:
523
  
Inhibitor
Name:
BDBM50448404
Synonyms:
CHEMBL3121751
Type:
Small organic molecule
Emp. Form.:
C21H25NO
Mol. Mass.:
307.4293
SMILES:
CC1(C)CCC(C)(C)c2cc(ccc12)C(=O)Nc1ccccc1
: