Target
Serine/threonine-protein kinase B-raf
Ligand
BDBM99471
Substrate
Meas. Tech.
ChEMBL_1296295 (CHEMBL3129554)
IC50
8.3±n/a nM
Citation
 Okaniwa, MHirose, MArita, TYabuki, MNakamura, ATakagi, TKawamoto, TUchiyama, NSumita, ATsutsumi, STottori, TInui, YSang, BCYano, JAertgeerts, KYoshida, SIshikawa, T Discovery of a selective kinase inhibitor (TAK-632) targeting pan-RAF inhibition: design, synthesis, and biological evaluation of C-7-substituted 1,3-benzothiazole derivatives. J Med Chem 56:6478-94 (2013)  
Target
Name:
Serine/threonine-protein kinase B-raf
Synonyms:
B-RAF B-Raf proto-oncogene serine/threonine-protein kinase BRAF1 RAFB1 v-Raf murine sarcoma viral oncogene homolog B1
Type:
Serine/threonine-protein kinase
Mol. Mass.:
84446.00
Organism:
Homo sapiens (Human)
Description:
P15056
Residue:
766
  
Inhibitor
Name:
BDBM99471
Synonyms:
US8497274, 32
Type:
Small organic molecule
Emp. Form.:
C27H18F4N4O3S
Mol. Mass.:
554.515
SMILES:
Fc1ccc(Oc2ccc3nc(NC(=O)C4CC4)sc3c2C#N)cc1NC(=O)Cc1cccc(c1)C(F)(F)F
: