Target
DNA polymerase subunit gamma-1
Ligand
BDBM50448482
Substrate
Meas. Tech.
ChEMBL_1298182 (CHEMBL3130053)
IC50
3000±n/a nM
Citation
 Low, WKLi, JZhu, MKommaraju, SSShah-Mittal, JHull, KLiu, JORomo, D Second-generation derivatives of the eukaryotic translation initiation inhibitor pateamine A targeting eIF4A as potential anticancer agents. Bioorg Med Chem 22:116-25 (2013)  
Target
Name:
DNA polymerase subunit gamma-1
Synonyms:
DNA Polymerase gamma DNA polymerase (alpha/delta/epsilon) DNA polymerase delta subunit 1 DNA polymerase gamma subunit 1 DNA polymerase kappa DNA polymerase subunit gamma-1 DPOG1_HUMAN Mitochondrial DNA polymerase catalytic subunit POLG1 PolG-alpha
Type:
Enzyme Subunit
Mol. Mass.:
139566.98
Organism:
Homo sapiens (Human)
Description:
Enzyme was purchased from Ulrich Hubscher, University of Zurich-Irchel, Switzerland.
Residue:
1239
  
Inhibitor
Name:
BDBM50448482
Synonyms:
CHEMBL3126408
Type:
Small organic molecule
Emp. Form.:
C30H42N2O4S
Mol. Mass.:
526.73
SMILES:
C[C@H]1C\C(C)=C\C=C/C(=O)O[C@@H](Cc2nc(CCCCC(=O)O1)cs2)\C=C(/C)\C=C\C(\C)=C\CN(C)C
: