Target
Hexokinase-4
Ligand
BDBM50447286
Substrate
Meas. Tech.
ChEMBL_1296096 (CHEMBL3131525)
EC50
>50000±n/a nM
Citation
 Ashton, KSAndrews, KLBryan, MCBryan, MCChen, JChen, KChen, MChmait, SCroghan, MCupples, RFotsch, CHelmering, JJordan, SRKurzeja, RJMichelsen, KPennington, LDPoon, SFSivits, GVan, GVonderfecht, SLWahl, RCZhang, JLloyd, DJHale, CSt Jean, DJ Small molecule disruptors of the glucokinase-glucokinase regulatory protein interaction: 1. Discovery of a novel tool compound for in vivo proof-of-concept. J Med Chem 57:309-24 (2014)  
Target
Name:
Hexokinase-4
Synonyms:
GCK Glucokinase (GK) HK IV HXK4_HUMAN Hexokinase-D
Type:
Enzyme
Mol. Mass.:
52175.81
Organism:
Homo sapiens (Human)
Description:
P35557
Residue:
465
  
Inhibitor
Name:
BDBM50447286
Synonyms:
CHEMBL3113992
Type:
Small organic molecule
Emp. Form.:
C17H16F6N2O3S2
Mol. Mass.:
474.441
SMILES:
OC(c1ccc(cc1)N1CCN(CC1)S(=O)(=O)c1cccs1)(C(F)(F)F)C(F)(F)F
: