Target
Serine/threonine-protein kinase PAK 4
Ligand
BDBM50448771
Substrate
Meas. Tech.
ChEMBL_1294402 (CHEMBL3129187)
IC50
7.5±n/a nM
Citation
 Staben, STFeng, JALyle, KBelvin, MBoggs, JBurch, JDChua, CCCui, HDiPasquale, AGFriedman, LSHeise, CKoeppen, HKotey, AMintzer, ROh, ARoberts, DARouge, LRudolph, JTam, CWang, WXiao, YYoung, AZhang, YHoeflich, KP Back pocket flexibility provides group II p21-activated kinase (PAK) selectivity for type I 1/2 kinase inhibitors. J Med Chem 57:1033-45 (2014)  
Target
Name:
Serine/threonine-protein kinase PAK 4
Synonyms:
KIAA1142 PAK4_HUMAN | p21-Activated kinase 4 (PAK4)
Type:
Protein
Mol. Mass.:
64098.01
Organism:
Homo sapiens (Human)
Description:
O96013
Residue:
591
  
Inhibitor
Name:
BDBM50448771
Synonyms:
CHEMBL3128042
Type:
Small organic molecule
Emp. Form.:
C22H26N6O2
Mol. Mass.:
406.4808
SMILES:
COCCNc1nc2ccc(cc2n1-c1ccnc(N)n1)C#CC1(O)CCCCC1
: