Target
Aldehyde dehydrogenase, dimeric NADP-preferring
Ligand
BDBM50448790
Substrate
Meas. Tech.
ChEMBL_1295310 (CHEMBL3128577)
Ki
380±n/a nM
Citation
 Kimble-Hill, ACParajuli, BChen, CHMochly-Rosen, DHurley, TD Development of selective inhibitors for aldehyde dehydrogenases based on substituted indole-2,3-diones. J Med Chem 57:714-22 (2014)  
Target
Name:
Aldehyde dehydrogenase, dimeric NADP-preferring
Synonyms:
AL3A1_HUMAN ALDH3A1 Aldehyde dehydrogenase family 3 member A1 (ALDH3A1) | Aldehyde dehydrogenase family 3 member A1 (ALDH3A1) (Q122A)
Type:
Protein
Mol. Mass.:
50394.38
Organism:
Homo sapiens (Human)
Description:
Residue:
453
  
Inhibitor
Name:
BDBM50448790
Synonyms:
CHEMBL3128208
Type:
Small organic molecule
Emp. Form.:
C9H6BrNO2
Mol. Mass.:
240.053
SMILES:
Cc1cc2C(=O)C(=O)Nc2c(Br)c1
: