Target
Neuronal acetylcholine receptor subunit alpha-4/beta-2
Ligand
BDBM50451795
Substrate
Meas. Tech.
ChEMBL_143558 (CHEMBL755330)
Ki
206±n/a nM
Citation
 Ferretti, GDukat, MGiannella, MPiergentili, APigini, MQuaglia, WDamaj, MIMartin, BRGlennon, RA Binding of nicotine and homoazanicotine analogues at neuronal nicotinic acetylcholinergic (nACh) receptors. Bioorg Med Chem Lett 13:733-5 (2003)  
Target
Name:
Neuronal acetylcholine receptor subunit alpha-4/beta-2
Synonyms:
Neuronal acetylcholine receptor alpha4/beta2 Neuronal acetylcholine receptor; alpha4/beta2
Type:
Mol. Mass.:
Description:
Components:
This complex has 0 components.
Component 1
Name:
Neuronal acetylcholine receptor subunit alpha-4
Synonyms:
ACHA4_RAT Cholinergic, Nicotinic Alpha4Beta2 Chrna4 Neuronal acetylcholine receptor (alpha4beta2 nAChR) Neuronal acetylcholine receptor subunit alpha 4 beta 2 | Neuronal acetylcholine receptor subunit alpha-4
Type:
Enzyme
Mol. Mass.:
70196.44
Organism:
Rattus norvegicus (Rat)
Description:
P09483
Residue:
630
  
Component 2
Name:
Neuronal acetylcholine receptor subunit beta-2
Synonyms:
ACHB2_RAT Chrnb2 Neuronal acetylcholine receptor non-alpha-1 chain
Type:
Enzyme
Mol. Mass.:
56910.32
Organism:
Rattus norvegicus (Rat)
Description:
P12390
Residue:
500
  
Inhibitor
Name:
BDBM50451795
Synonyms:
CHEMBL329602
Type:
Small organic molecule
Emp. Form.:
C9H11N3
Mol. Mass.:
161.2037
SMILES:
CN1CCN=C1c1cccnc1
: