Target
Neuronal acetylcholine receptor subunit alpha-4/beta-2
Ligand
BDBM50125053
Substrate
Meas. Tech.
ChEMBL_143558 (CHEMBL755330)
Ki
3300±n/a nM
Citation
 Ferretti, GDukat, MGiannella, MPiergentili, APigini, MQuaglia, WDamaj, MIMartin, BRGlennon, RA Binding of nicotine and homoazanicotine analogues at neuronal nicotinic acetylcholinergic (nACh) receptors. Bioorg Med Chem Lett 13:733-5 (2003)  
Target
Name:
Neuronal acetylcholine receptor subunit alpha-4/beta-2
Synonyms:
Neuronal acetylcholine receptor alpha4/beta2 Neuronal acetylcholine receptor; alpha4/beta2
Type:
Mol. Mass.:
Description:
Components:
This complex has 0 components.
Component 1
Name:
Neuronal acetylcholine receptor subunit alpha-4
Synonyms:
ACHA4_RAT Cholinergic, Nicotinic Alpha4Beta2 Chrna4 Neuronal acetylcholine receptor (alpha4beta2 nAChR) Neuronal acetylcholine receptor subunit alpha 4 beta 2 | Neuronal acetylcholine receptor subunit alpha-4
Type:
Enzyme
Mol. Mass.:
70196.44
Organism:
Rattus norvegicus (Rat)
Description:
P09483
Residue:
630
  
Component 2
Name:
Neuronal acetylcholine receptor subunit beta-2
Synonyms:
ACHB2_RAT Chrnb2 Neuronal acetylcholine receptor non-alpha-1 chain
Type:
Enzyme
Mol. Mass.:
56910.32
Organism:
Rattus norvegicus (Rat)
Description:
P12390
Residue:
500
  
Inhibitor
Name:
BDBM50125053
Synonyms:
3-(4,5-Dihydro-3H-pyrrol-2-yl)-pyridine US8609708, 79 Myosmine
Type:
Small organic molecule
Emp. Form.:
C9H10N2
Mol. Mass.:
146.1891
SMILES:
C1CN=C(C1)c1cccnc1
: