Target
Gag-Pol polyprotein [489-587]
Ligand
BDBM50000794
Substrate
Meas. Tech.
ChEMBL_158036 (CHEMBL768260)
Ki
5±n/a nM
Citation
 Doweyko, AM Three-dimensional pharmacophores from binding data. J Med Chem 37:1769-78 (1994)  
Target
Name:
Gag-Pol polyprotein [489-587]
Synonyms:
Human immunodeficiency virus type 1 protease Pol polyprotein | gag-pol
Type:
Enzyme Subunit
Mol. Mass.:
10781.16
Organism:
Human immunodeficiency virus type 1
Description:
P04585[489-587]
Residue:
99
  
Inhibitor
Name:
BDBM50000794
Synonyms:
CHEMBL299376
Type:
Small organic molecule
Emp. Form.:
C46H63N7O7
Mol. Mass.:
826.0351
SMILES:
CC[C@H](C)[C@H](NC(=O)[C@H](CC(C)C)[C@@H](O)[C@H](O)[C@H](CC1CCCCC1)NC(=O)[C@H](Cc1c[nH]cn1)NC(=O)COc1cccc2ccccc12)C(=O)NCc1ccccn1
: