Target
Substance-K receptor
Ligand
BDBM50002946
Substrate
Meas. Tech.
ChEMBL_448551 (CHEMBL897700)
Ki
1.3±n/a nM
Citation
 Sisto, AAltamura, MCardinali, FD'Andrea, PRossi, CFattori, D alpha,alpha-Cyclic aminoacids as useful scaffolds for the preparation of hNK(2) receptor antagonists. Bioorg Med Chem Lett 17:4841-4 (2007)  
Target
Name:
Substance-K receptor
Synonyms:
NK-2 receptor NK2R NKNAR Neurokinin A receptor Neurokinin-2 (NK-2) SKR TACR2 Tachykinin receptor 2 (NK2) | hnk-3
Type:
Protein
Mol. Mass.:
44455.78
Organism:
Homo sapiens (Human)
Description:
P21452
Residue:
398
  
Inhibitor
Name:
BDBM50002946
Synonyms:
CHEMBL394418
Type:
Small organic molecule
Emp. Form.:
C35H38N4O3S
Mol. Mass.:
594.766
SMILES:
O=C(NCCCN1CCCC1)[C@@H](Cc1ccccc1)NC(=O)C1(CCc2ccccc12)NC(=O)c1cc2ccccc2s1
: