Target
Orexin receptor type 2
Ligand
BDBM104689
Substrate
Meas. Tech.
ChEMBL_1337234 (CHEMBL3240642)
IC50
15±n/a nM
Citation
 Kuduk, SDSkudlarek, JWDi Marco, CNBruno, JGPausch, MAO'Brien, JACabalu, TDStevens, JBrunner, JTannenbaum, PLGotter, ALWinrow, CJRenger, JJColeman, PJ Synthesis and evaluation of carbon-linked analogs of dual orexin receptor antagonist filorexant. Bioorg Med Chem Lett 24:1784-9 (2014)  
Target
Name:
Orexin receptor type 2
Synonyms:
HCRTR2 OX2R_HUMAN Orexin receptor type 2 (OR-2) Orexin receptor type 2 (OX2R) Ox-2-R | Ox2-R
Type:
Protein
Mol. Mass.:
50710.53
Organism:
Homo sapiens (Human)
Description:
O43614
Residue:
444
  
Inhibitor
Name:
BDBM104689
Synonyms:
US8569311, A-9
Type:
Small organic molecule
Emp. Form.:
C22H24FN5O2
Mol. Mass.:
409.4567
SMILES:
C[C@@H]1CC[C@@H](COc2ccc(F)cn2)CN1C(=O)c1cc(C)ccc1-n1nccn1
: