Target
Estrogen receptor
Ligand
BDBM50001003
Substrate
Meas. Tech.
ChEMBL_1337645 (CHEMBL3242833)
IC50
26±n/a nM
Citation
 Kajita, DNakamura, MMatsumoto, YMakishima, MHashimoto, Y Design and synthesis of silicon-containing steroid sulfatase inhibitors possessing pro-estrogen antagonistic character. Bioorg Med Chem 22:2244-52 (2014)  
Target
Name:
Estrogen receptor
Synonyms:
ER ESR ESR1_HUMAN Estrogen receptor Estrogen receptor (ER-alpha) Estrogen receptor alpha (ER) Nuclear receptor subfamily 3 group A member 1
Type:
Protein
Mol. Mass.:
66230.44
Organism:
Homo sapiens (Human)
Description:
P03372
Residue:
595
  
Inhibitor
Name:
BDBM50001003
Synonyms:
CHEMBL3235686
Type:
Small organic molecule
Emp. Form.:
C20H28O2Si
Mol. Mass.:
328.5206
SMILES:
CCC[Si](CCC)(c1ccc(O)c(C)c1)c1ccc(O)c(C)c1
: