Target
Estrogen receptor beta
Ligand
BDBM50001003
Substrate
Meas. Tech.
ChEMBL_1337649 (CHEMBL3242837)
IC50
804±n/a nM
Citation
 Kajita, DNakamura, MMatsumoto, YMakishima, MHashimoto, Y Design and synthesis of silicon-containing steroid sulfatase inhibitors possessing pro-estrogen antagonistic character. Bioorg Med Chem 22:2244-52 (2014)  
Target
Name:
Estrogen receptor beta
Synonyms:
ER-beta ESR2_HUMAN Estradiol receptor beta (ERβ) Estrogen receptor (ER beta) Estrogen receptor beta (ER beta) NR3A2 estrogen beta
Type:
Protein
Mol. Mass.:
59238.43
Organism:
Homo sapiens (Human)
Description:
Q92731
Residue:
530
  
Inhibitor
Name:
BDBM50001003
Synonyms:
CHEMBL3235686
Type:
Small organic molecule
Emp. Form.:
C20H28O2Si
Mol. Mass.:
328.5206
SMILES:
CCC[Si](CCC)(c1ccc(O)c(C)c1)c1ccc(O)c(C)c1
: