Target
Steryl-sulfatase
Ligand
BDBM50001004
Substrate
Meas. Tech.
ChEMBL_1337650 (CHEMBL3242838)
IC50
1024±n/a nM
Citation
 Kajita, DNakamura, MMatsumoto, YMakishima, MHashimoto, Y Design and synthesis of silicon-containing steroid sulfatase inhibitors possessing pro-estrogen antagonistic character. Bioorg Med Chem 22:2244-52 (2014)  
Target
Name:
Steryl-sulfatase
Synonyms:
ARSC1 Arylsulfatase C STS_HUMAN Steryl-sulfate sulfohydrolase
Type:
Enzyme
Mol. Mass.:
65503.66
Organism:
Homo sapiens (Human)
Description:
P08842
Residue:
583
  
Inhibitor
Name:
BDBM50001004
Synonyms:
CHEMBL3235681
Type:
Small organic molecule
Emp. Form.:
C13H14N2O6S2
Mol. Mass.:
358.39
SMILES:
NS(=O)(=O)Oc1ccc(Cc2ccc(OS(N)(=O)=O)cc2)cc1
: