Target
Acetylcholinesterase
Ligand
BDBM50003957
Substrate
Meas. Tech.
ChEMBL_1337354 (CHEMBL3241348)
IC50
1590±n/a nM
Citation
 Saeed, AMahesar, PAZaib, SKhan, MSMatin, AShahid, MIqbal, J Synthesis, cytotoxicity and molecular modelling studies of new phenylcinnamide derivatives as potent inhibitors of cholinesterases. Eur J Med Chem 78:43-53 (2014)  
Target
Name:
Acetylcholinesterase
Synonyms:
ACES_ELEEL Acetylcholinesterase (EeAChE) | ache
Type:
Enzyme
Mol. Mass.:
71812.79
Organism:
Electrophorus electricus (Electric eel)
Description:
Residue:
633
  
Inhibitor
Name:
BDBM50003957
Synonyms:
CHEMBL3236083
Type:
Small organic molecule
Emp. Form.:
C25H25NO6
Mol. Mass.:
435.4691
SMILES:
COc1cc(NC(=O)\C=C\c2ccc(OCc3ccccc3)cc2O)cc(OC)c1OC
: