Target
Acetylcholinesterase
Ligand
BDBM50003960
Substrate
Meas. Tech.
ChEMBL_1337354 (CHEMBL3241348)
IC50
1410±n/a nM
Citation
 Saeed, AMahesar, PAZaib, SKhan, MSMatin, AShahid, MIqbal, J Synthesis, cytotoxicity and molecular modelling studies of new phenylcinnamide derivatives as potent inhibitors of cholinesterases. Eur J Med Chem 78:43-53 (2014)  
Target
Name:
Acetylcholinesterase
Synonyms:
ACES_ELEEL Acetylcholinesterase (EeAChE) | ache
Type:
Enzyme
Mol. Mass.:
71812.79
Organism:
Electrophorus electricus (Electric eel)
Description:
Residue:
633
  
Inhibitor
Name:
BDBM50003960
Synonyms:
CHEMBL3236088
Type:
Small organic molecule
Emp. Form.:
C21H23NO5
Mol. Mass.:
369.411
SMILES:
COc1cc(NC(=O)\C=C\c2ccccc2OCC=C)cc(OC)c1OC
: