Target
Nuclear receptor ROR-gamma
Ligand
BDBM50005486
Substrate
Meas. Tech.
ChEMBL_1338694 (CHEMBL3242032)
IC50
4900±n/a nM
Citation
 Zhang, YXue, XJin, XSong, YLi, JLuo, XSong, MYan, WSong, HXu, Y Discovery of 2-oxo-1,2-dihydrobenzo[cd]indole-6-sulfonamide derivatives as new ROR¿ inhibitors using virtual screening, synthesis and biological evaluation. Eur J Med Chem 78:431-41 (2014)  
Target
Name:
Nuclear receptor ROR-gamma
Synonyms:
NR1F3 Nuclear receptor ROR-gamma (RORC) RAR-related orphan receptor C (RORc) RORG RZRG Retinoid-related orphan receptor-gamma (RORc)
Type:
Enzyme Catalytic Domain
Mol. Mass.:
58218.40
Organism:
Homo sapiens (Human)
Description:
P51449
Residue:
518
  
Inhibitor
Name:
BDBM50005486
Synonyms:
CHEMBL142091 | CHEMBL3234257
Type:
Small organic molecule
Emp. Form.:
C23H24N2O3S
Mol. Mass.:
408.513
SMILES:
CCN1C(=O)c2cccc3c(ccc1c23)S(=O)(=O)Nc1ccccc1C(C)(C)C
: