Target
Histamine H4 receptor
Ligand
BDBM50006745
Substrate
Meas. Tech.
ChEMBL_1336216 (CHEMBL3241464)
Ki
0.920000±n/a nM
Citation
 Savall, BMChavez, FTays, KDunford, PJCowden, JMHack, MDWolin, RLThurmond, RLEdwards, JP Discovery and SAR of 6-alkyl-2,4-diaminopyrimidines as histamine H4 receptor antagonists. J Med Chem 57:2429-39 (2014)  
Target
Name:
Histamine H4 receptor
Synonyms:
AXOR35 GPCR105 HH4R HRH4 Histamine H4 receptor Histamine receptor (H3 and H4) SP9144
Type:
G Protein-Coupled Receptor (GPCR)
Mol. Mass.:
44517.02
Organism:
Homo sapiens (Human)
Description:
Binding assays were using CHO cells stably expressing hH4R receptors.
Residue:
390
  
Inhibitor
Name:
BDBM50006745
Synonyms:
CHEMBL3236556
Type:
Small organic molecule
Emp. Form.:
C13H21N5
Mol. Mass.:
247.3393
SMILES:
N[C@@H]1CCN(C1)c1cc(nc(N)n1)C1CCCC1
: