Target
Prostaglandin D2 receptor
Ligand
BDBM50006830
Substrate
Meas. Tech.
ChEMBL_1336705 (CHEMBL3240853)
IC50
16000±n/a nM
Citation
 Kaila, NFollows, BLeung, LThomason, JHuang, AMoretto, AJanz, KLowe, MMansour, TSHubeau, CPage, KMorgan, PFish, SXu, XWilliams, CSaiah, E Discovery of isoquinolinone indole acetic acids as antagonists of chemoattractant receptor homologous molecule expressed on Th2 cells (CRTH2) for the treatment of allergic inflammatory diseases. J Med Chem 57:1299-322 (2014)  
Target
Name:
Prostaglandin D2 receptor
Synonyms:
PD2R_HUMAN Prostaglandin D2 Prostanoid DP receptor
Type:
Enzyme
Mol. Mass.:
40288.87
Organism:
Homo sapiens (Human)
Description:
Q13258
Residue:
359
  
Inhibitor
Name:
BDBM50006830
Synonyms:
CHEMBL3236948
Type:
Small organic molecule
Emp. Form.:
C23H21FN2O3
Mol. Mass.:
392.4228
SMILES:
CC(C)n1cc(-c2c(C)n(CC(O)=O)c3ccc(F)cc23)c2ccccc2c1=O
: