Target
Prostaglandin D2 receptor 2
Ligand
BDBM50006830
Substrate
Meas. Tech.
ChEMBL_1336706 (CHEMBL3240854)
IC50
4.0±n/a nM
Citation
 Kaila, NFollows, BLeung, LThomason, JHuang, AMoretto, AJanz, KLowe, MMansour, TSHubeau, CPage, KMorgan, PFish, SXu, XWilliams, CSaiah, E Discovery of isoquinolinone indole acetic acids as antagonists of chemoattractant receptor homologous molecule expressed on Th2 cells (CRTH2) for the treatment of allergic inflammatory diseases. J Med Chem 57:1299-322 (2014)  
Target
Name:
Prostaglandin D2 receptor 2
Synonyms:
CD294 antigen G protein-coupled receptor 44 PD2R2_MOUSE | Ptgdr2
Type:
G Protein-Coupled Receptor (GPCR)
Mol. Mass.:
42975.89
Organism:
Mus musculus (mouse)
Description:
Human embryonic kidney (HEK) 293(EBNA) cells were transfected with mouse CRTH2.
Residue:
382
  
Inhibitor
Name:
BDBM50006830
Synonyms:
CHEMBL3236948
Type:
Small organic molecule
Emp. Form.:
C23H21FN2O3
Mol. Mass.:
392.4228
SMILES:
CC(C)n1cc(-c2c(C)n(CC(O)=O)c3ccc(F)cc23)c2ccccc2c1=O
: