Target
Prostaglandin D2 receptor 2
Ligand
BDBM50006830
Substrate
Meas. Tech.
ChEMBL_1337061 (CHEMBL3242795)
Temperature
298.15±n/a K
IC50
8.0±n/a nM
Comments
extracted
Citation
 Kaila, NFollows, BLeung, LThomason, JHuang, AMoretto, AJanz, KLowe, MMansour, TSHubeau, CPage, KMorgan, PFish, SXu, XWilliams, CSaiah, E Discovery of isoquinolinone indole acetic acids as antagonists of chemoattractant receptor homologous molecule expressed on Th2 cells (CRTH2) for the treatment of allergic inflammatory diseases. J Med Chem 57:1299-322 (2014)  
Target
Name:
Prostaglandin D2 receptor 2
Synonyms:
CD_antigen=CD294 Chemoattractant Receptor-homologous molecule expressed on T-helper type 2 cells (CRTH2) Chemoattractant receptor-homologous molecule expressed on Th2 cells (CRTH2) G protein-coupled receptor 44 GPR44 PTGDR2 Prostaglandin D2 receptor 2 | Prostaglandin D2 receptor 2 (PGD2)
Type:
Enzyme
Mol. Mass.:
43295.45
Organism:
Homo sapiens (Human)
Description:
Q9Y5Y4
Residue:
395
  
Inhibitor
Name:
BDBM50006830
Synonyms:
CHEMBL3236948
Type:
Small organic molecule
Emp. Form.:
C23H21FN2O3
Mol. Mass.:
392.4228
SMILES:
CC(C)n1cc(-c2c(C)n(CC(O)=O)c3ccc(F)cc23)c2ccccc2c1=O
: