Target
Lysosomal protective protein
Ligand
BDBM50069989
Substrate
Meas. Tech.
ChEMBL_1338354 (CHEMBL3240090)
IC50
9200±n/a nM
Citation
 Kawamura, SUnno, YAsai, AArisawa, MShuto, S Structurally novel highly potent proteasome inhibitors created by the structure-based hybridization of nonpeptidic belactosin derivatives and peptide boronates. J Med Chem 57:2726-35 (2014)  
Target
Name:
Lysosomal protective protein
Synonyms:
CTSA Cathepsin A (CTSA) PPGB | PPGB_HUMAN
Type:
Protein
Mol. Mass.:
54465.95
Organism:
Homo sapiens (Human)
Description:
P10619
Residue:
480
  
Inhibitor
Name:
BDBM50069989
Synonyms:
(R)-3-methyl-1-((S)-3-phenyl-2-(pyrazine-2-carboxamido)propanamido)butylboronic acid BORTEZOMIB Dipeptidyl boronic acid derivative N-[(1R)-1-(DIHYDROXYBORYL)-3-METHYLBUTYL]-N-(PYRAZIN-2-YLCARBONYL)-L-PHENYLALANINAMIDE Peptidyl boronic acid derivative Velcade | cid_387447
Type:
Small organic molecule
Emp. Form.:
C19H25BN4O4
Mol. Mass.:
384.237
SMILES:
CC(C)C[C@H](NC(=O)[C@H](Cc1ccccc1)NC(=O)c1cnccn1)B(O)O
: