Target
ATP-dependent translocase ABCB1
Ligand
BDBM81939
Substrate
Meas. Tech.
ChEMBL_1338425 (CHEMBL3240478)
EC50
20000±n/a nM
Citation
 Nesi, GColabufo, NAContino, MPerrone, MGDigiacomo, MPerrone, RLapucci, AMacchia, MRapposelli, S SAR study on arylmethyloxyphenyl scaffold: looking for a P-gp nanomolar affinity. Eur J Med Chem 76:558-66 (2014)  
Target
Name:
ATP-dependent translocase ABCB1
Synonyms:
ABCB1 MDR1_HUMAN Multidrug resistance protein 1 P-glycoprotein (P-gp) PGY1
Type:
Protein
Mol. Mass.:
141503.50
Organism:
Homo sapiens (Human)
Description:
P08183
Residue:
1280
  
Inhibitor
Name:
BDBM81939
Synonyms:
CAS_52-53-9 VERAPAMIL
Type:
Small organic molecule
Emp. Form.:
C27H38N2O4
Mol. Mass.:
454.6016
SMILES:
COc1ccc(CCN(C)CCCC(C#N)(C(C)C)c2ccc(OC)c(OC)c2)cc1OC
: