Target
Sterol O-acyltransferase 2
Ligand
BDBM50009432
Substrate
Meas. Tech.
ChEMBL_1335972 (CHEMBL3239093)
IC50
9700±n/a nM
Citation
 Zhou, GTing, PCWishart, GZorn, NAslanian, RGLin, MSmith, MWalker, SSCook, JVan Heek, MLachowicz, J Discovery of novel quinoline carboxylic acid series as DGAT1 inhibitors. Bioorg Med Chem Lett 24:1790-4 (2014)  
Target
Name:
Sterol O-acyltransferase 2
Synonyms:
ACACT2 ACAT2 Acetyl-CoA transferase-like protein Cholesterol acyltransferase 2 SOAT2 | SOAT2_HUMAN
Type:
Enzyme
Mol. Mass.:
59912.75
Organism:
Homo sapiens (Human)
Description:
O75908
Residue:
522
  
Inhibitor
Name:
BDBM50009432
Synonyms:
CHEMBL3233884
Type:
Small organic molecule
Emp. Form.:
C29H30N2O4
Mol. Mass.:
470.5595
SMILES:
OC(=O)C[C@H]1CC[C@@H](CC1)c1ccc(cc1)-c1ccc2N(CCOc2c1)C(=O)Nc1ccccc1
: