Target
Ornithine decarboxylase
Ligand
BDBM50009740
Substrate
Meas. Tech.
ChEMBL_1344643 (CHEMBL3254305)
Ki
70000±n/a nM
Citation
 Bey, PDanzin, CVan Dorsselaer, VMamont, PJung, MTardif, C Analogues of ornithine as inhibitors of ornithine decarboxylase. New deductions concerning the topography of the enzyme's active site. J Med Chem 21:50-5 (1978)  
Target
Name:
Ornithine decarboxylase
Synonyms:
DCOR_BOVIN ODC1
Type:
PROTEIN
Mol. Mass.:
51336.97
Organism:
Bos taurus
Description:
ChEMBL_108299
Residue:
461
  
Inhibitor
Name:
BDBM50009740
Synonyms:
CHEMBL3247539
Type:
Small organic molecule
Emp. Form.:
C5H13ClN6
Mol. Mass.:
192.65
SMILES:
Cl.NCCCC(N)c1nnn[nH]1
: