Target
Ornithine decarboxylase
Ligand
BDBM50009353
Substrate
Meas. Tech.
ChEMBL_1344643 (CHEMBL3254305)
Ki
3000000±n/a nM
Citation
 Bey, PDanzin, CVan Dorsselaer, VMamont, PJung, MTardif, C Analogues of ornithine as inhibitors of ornithine decarboxylase. New deductions concerning the topography of the enzyme's active site. J Med Chem 21:50-5 (1978)  
Target
Name:
Ornithine decarboxylase
Synonyms:
DCOR_BOVIN ODC1
Type:
PROTEIN
Mol. Mass.:
51336.97
Organism:
Bos taurus
Description:
ChEMBL_108299
Residue:
461
  
Inhibitor
Name:
BDBM50009353
Synonyms:
1,5,10-triazadecane 4-azaoctane-1,8-diamine N-(3-aminopropyl)butane-1,4-diamine | spermidine
Type:
Small organic molecule
Emp. Form.:
C7H19N3
Mol. Mass.:
145.2459
SMILES:
NCCCCNCCCN
: