Target
Ornithine decarboxylase
Ligand
BDBM50009921
Substrate
Meas. Tech.
ChEMBL_1344637 (CHEMBL3254299)
Ki
500000±n/a nM
Citation
 Bey, PDanzin, CVan Dorsselaer, VMamont, PJung, MTardif, C Analogues of ornithine as inhibitors of ornithine decarboxylase. New deductions concerning the topography of the enzyme's active site. J Med Chem 21:50-5 (1978)  
Target
Name:
Ornithine decarboxylase
Synonyms:
DCOR_RAT Odc1
Type:
PROTEIN
Mol. Mass.:
51037.04
Organism:
Rattus norvegicus
Description:
ChEMBL_1344641
Residue:
461
  
Inhibitor
Name:
BDBM50009921
Synonyms:
CHEMBL3247530
Type:
Small organic molecule
Emp. Form.:
C7H16N2O2
Mol. Mass.:
160.2141
SMILES:
CNCCCC(C)(N)C(O)=O
: